Reaction Details
TargetStromelysin-1
LigandBDBM50031772
Substrate/Competitorn/a
Meas. Tech.ChEMBL_458939 (CHEMBL924958)
Ki 363±n/a nM
Citation Verma, RPHansch, C Matrix metalloproteinases (MMPs): chemical-biological functions and (Q)SARs. Bioorg Med Chem15:2223-68 (2007) 
 
Stromelysin-1
Name:Stromelysin-1
Type:Enzyme
Mol. Mass.:53973.13
Organism:Homo sapiens (Human)
Description: P08254
Residue:477
BDBM50031772
NameBDBM50031772
Synonyms:(R)-3-((S)-1-Methylcarbamoyl-2-phenyl-ethylcarbamoyl)-heptanedioic acid 1-hydroxyamide 7-propylamide CHEMBL85766
TypeSmall organic molecule
Emp. Form.C21H32N4O5
Mol. Mass.420.5026
SMILESCCCNC(=O)CCC[C@H](CC(=O)NO)C(=O)N[C@@H](Cc1ccccc1)C(=O)NC