Reaction Details
TargetMatrix metalloproteinase-9
LigandBDBM50160852
Substrate/Competitorn/a
Meas. Tech.ChEMBL_458932 (CHEMBL924951)
Ki 7.2±n/a nM
Citation Verma, RPHansch, C Matrix metalloproteinases (MMPs): chemical-biological functions and (Q)SARs. Bioorg Med Chem15:2223-68 (2007) 
 
Matrix metalloproteinase-9
Name:Matrix metalloproteinase-9
Type:Enzyme
Mol. Mass.:78452.28
Organism:Homo sapiens (Human)
Description:P14780
Residue:707
BDBM50160852
NameBDBM50160852
Synonyms:4-ethyl-1-(4-phenoxy-phenyl)-1,7,9-triaza-spiro[4.5]decane-2,6,8,10-tetraone | CHEMBL361527
TypeSmall organic molecule
Emp. Form.C21H19N3O5
Mol. Mass.393.3927
SMILESCCC1CC(=O)N(c2ccc(Oc3ccccc3)cc2)C11C(=O)NC(=O)NC1=O