Reaction Details
TargetStromelysin-1
LigandBDBM50285567
Substrate/Competitorn/a
Meas. Tech.ChEMBL_458939 (CHEMBL924958)
Ki 33±n/a nM
Citation Verma, RPHansch, C Matrix metalloproteinases (MMPs): chemical-biological functions and (Q)SARs. Bioorg Med Chem15:2223-68 (2007) 
 
Stromelysin-1
Name:Stromelysin-1
Type:Enzyme
Mol. Mass.:53973.13
Organism:Homo sapiens (Human)
Description: P08254
Residue:477
BDBM50285567
NameBDBM50285567
Synonyms:(R)-2-[(S)-1-((S)-4-guanidino-1-phenylcarbamoyl-butylcarbamoyl)-3-(4-propyl-phenyl)-propylamino]-propionic acid | CHEMBL251482
TypeSmall organic molecule
Emp. Form.C28H40N6O4
Mol. Mass.524.655
SMILES[#6]-[#6]-[#6]-c1ccc(-[#6]-[#6]-[#6@H](-[#7]-[#6@H](-[#6])-[#6](-[#8])=O)-[#6](=O)-[#7]-[#6@@H](-[#6]-[#6]-[#6]\[#7]=[#6](\[#7])-[#7])-[#6](=O)-[#7]-c2ccccc2)cc1