Reaction Details
TargetMatrix metalloproteinase-9
LigandBDBM50100798
Substrate/Competitorn/a
Meas. Tech.ChEMBL_458932 (CHEMBL924951)
Ki 4.4±n/a nM
Citation Verma, RPHansch, C Matrix metalloproteinases (MMPs): chemical-biological functions and (Q)SARs. Bioorg Med Chem15:2223-68 (2007) 
 
Matrix metalloproteinase-9
Name:Matrix metalloproteinase-9
Type:Enzyme
Mol. Mass.:78452.28
Organism:Homo sapiens (Human)
Description:P14780
Residue:707
BDBM50100798
NameBDBM50100798
Synonyms:2-(N-(2-nitrobenzyl)-2,2,12,12,15,15,18,18,18-nonafluorobutan-2-ylsulfonamido)-N-hydroxypropanamide N-Hydroxy-2-[(2-nitro-benzyl)-(nonafluorobutane-1-sulfonyl)-amino]-propionamide
TypeSmall organic molecule
Emp. Form.C14H12F9N3O6S
Mol. Mass.521.312
SMILESCC(N(Cc1ccccc1[N+]([O-])=O)S(=O)(=O)C(F)(F)C(F)(F)C(F)(F)C(F)(F)F)C(=O)NO