Reaction Details
TargetSomatostatin receptor type 4
LigandBDBM50423465
Substrate/Competitorn/a
Meas. Tech.ChEMBL_461990 (CHEMBL944833)
Kd 4898±n/a nM
Citation Troxler, TEnz, AHoyer, DLangenegger, DNeumann, PPfäffli, PSchoeffter, PHurth, K Ergoline derivatives as highly potent and selective antagonists at the somatostatin sst 1 receptor. Bioorg Med Chem Lett18:979-82 (2008) 
 
Somatostatin receptor type 4
Name:Somatostatin receptor type 4
Type:Enzyme
Mol. Mass.:42015.38
Organism:Homo sapiens (Human)
Description:P31391
Residue:388
BDBM50423465
NameBDBM50423465
Synonyms:ERGOLINE
TypeSmall organic molecule
Emp. Form.C26H30BrN5O2
Mol. Mass.524.453
SMILESCN1C[C@@H](C[C@H]2[C@H]1Cc1c(Br)[nH]c3cccc2c13)C(=O)N1CCN(CC1)c1cccc(=O)n1C