Reaction Details
TargetMuscarinic acetylcholine receptor M1
LigandBDBM50003351
Substrate/Competitorn/a
Meas. Tech.ChEMBL_469044 (CHEMBL929996)
IC50 77625±n/a nM
Citation Kane, BEGrant, MKEl-Fakahany, EEFerguson, DM Synthesis and evaluation of xanomeline analogs--probing the wash-resistant phenomenon at the M1 muscarinic acetylcholine receptor. Bioorg Med Chem16:1376-92 (2008) 
 
Muscarinic acetylcholine receptor M1
Name:Muscarinic acetylcholine receptor M1
Type:Protein
Mol. Mass.:51442.54
Organism:Homo sapiens (Human)
Description:P11229
Residue:460
BDBM50003351
NameBDBM50003351
Synonyms:3-(4-butoxy-1,2,5-thiadiazol-3-yl)-1-methyl-1,2,5,6-tetrahydropyridine 5-(4-Butoxy-[1,2,5]thiadiazol-3-yl)-1-methyl-1,2,3,6-tetrahydro-pyridine; oxalic acid | CHEMBL101054
TypeSmall organic molecule
Emp. Form.C12H19N3OS
Mol. Mass.253.364
SMILESCCCCOc1nsnc1C1=CCCN(C)C1