Reaction Details
TargetMuscarinic acetylcholine receptor M1
LigandBDBM50003366
Substrate/Competitorn/a
Meas. Tech.ChEMBL_469044 (CHEMBL929996)
IC50 8511±n/a nM
Citation Kane, BEGrant, MKEl-Fakahany, EEFerguson, DM Synthesis and evaluation of xanomeline analogs--probing the wash-resistant phenomenon at the M1 muscarinic acetylcholine receptor. Bioorg Med Chem16:1376-92 (2008) 
 
Muscarinic acetylcholine receptor M1
Name:Muscarinic acetylcholine receptor M1
Type:Protein
Mol. Mass.:51442.54
Organism:Homo sapiens (Human)
Description:P11229
Residue:460
BDBM50003366
NameBDBM50003366
Synonyms:1-Methyl-5-(4-pentyloxy-[1,2,5]thiadiazol-3-yl)-1,2,3,6-tetrahydro-pyridine 1-methyl-5-(4-(pentyloxy)-1,2,5-thiadiazol-3-yl)-1,2,3,6-tetrahydropyridine CHEMBL75552
TypeSmall organic molecule
Emp. Form.C13H21N3OS
Mol. Mass.267.39
SMILESCCCCCOc1nsnc1C1=CCCN(C)C1