Reaction Details
TargetMuscarinic acetylcholine receptor M1
LigandBDBM50003365
Substrate/Competitorn/a
Meas. Tech.ChEMBL_469043 (CHEMBL929995)
IC50 141±n/a nM
Citation Kane, BEGrant, MKEl-Fakahany, EEFerguson, DM Synthesis and evaluation of xanomeline analogs--probing the wash-resistant phenomenon at the M1 muscarinic acetylcholine receptor. Bioorg Med Chem16:1376-92 (2008) 
 
Muscarinic acetylcholine receptor M1
Name:Muscarinic acetylcholine receptor M1
Type:Protein
Mol. Mass.:51442.54
Organism:Homo sapiens (Human)
Description:P11229
Residue:460
BDBM50003365
NameBDBM50003365
Synonyms:3-(3-(ethoxy)-1,2,5-thiadiazol-4-yl)-1,2,5,6-tetrahydro-1-methylpyridine 5-(4-Ethoxy-[1,2,5]thiadiazol-3-yl)-1-methyl-1,2,3,6-tetrahydro-pyridine; oxalic acid CHEMBL99476
TypeSmall organic molecule
Emp. Form.C10H15N3OS
Mol. Mass.225.311
SMILESCCOc1nsnc1C1=CCCN(C)C1