Reaction Details
TargetCarbonic anhydrase 2
LigandBDBM50423782
Substrate/Competitorn/a
Meas. Tech.ChEMBL_698608 (CHEMBL1647881)
Ki 16±n/a nM
Citation Munei, YShimamoto, KHarada, MYoshida, TChuman, H Correlation analyses on binding affinity of substituted benzenesulfonamides with carbonic anhydrase using ab initio MO calculations on their complex structures (II). Bioorg Med Chem Lett21:141-4 (2010) 
 
Carbonic anhydrase 2
Name:Carbonic anhydrase 2
Type:Enzyme Catalytic Domain
Mol. Mass.:29115.93
Organism:Bos taurus
Description:n/a
Residue:260
BDBM50423782
NameBDBM50423782
Synonyms:3-Chloro-Benzenesulfonamide CHEMBL369271
TypeSmall organic molecule
Emp. Form.C6H6ClNO2S
Mol. Mass.191.635
SMILESNS(=O)(=O)c1cccc(Cl)c1