Reaction Details
TargetCarbonic anhydrase 2
LigandBDBM50423783
Substrate/Competitorn/a
Meas. Tech.ChEMBL_698608 (CHEMBL1647881)
Ki 17±n/a nM
Citation Munei, YShimamoto, KHarada, MYoshida, TChuman, H Correlation analyses on binding affinity of substituted benzenesulfonamides with carbonic anhydrase using ab initio MO calculations on their complex structures (II). Bioorg Med Chem Lett21:141-4 (2010) 
 
Carbonic anhydrase 2
Name:Carbonic anhydrase 2
Type:Enzyme Catalytic Domain
Mol. Mass.:29115.93
Organism:Bos taurus
Description:n/a
Residue:260
BDBM50423783
NameBDBM50423783
Synonyms:4-Acetyl-Benzenesulfonamide CHEMBL172294
TypeSmall organic molecule
Emp. Form.C8H9NO3S
Mol. Mass.199.227
SMILESCC(=O)c1ccc(cc1)S(N)(=O)=O