Reaction Details
TargetCarbonic anhydrase 2
LigandBDBM50423785
Substrate/Competitorn/a
Meas. Tech.ChEMBL_698608 (CHEMBL1647881)
Ki 2.5±n/a nM
Citation Munei, YShimamoto, KHarada, MYoshida, TChuman, H Correlation analyses on binding affinity of substituted benzenesulfonamides with carbonic anhydrase using ab initio MO calculations on their complex structures (II). Bioorg Med Chem Lett21:141-4 (2010) 
 
Carbonic anhydrase 2
Name:Carbonic anhydrase 2
Type:Enzyme Catalytic Domain
Mol. Mass.:29115.93
Organism:Bos taurus
Description:n/a
Residue:260
BDBM50423785
NameBDBM50423785
Synonyms:3,4-Dichloro-Benzenesulfonamide CHEMBL366729
TypeSmall organic molecule
Emp. Form.C6H5Cl2NO2S
Mol. Mass.226.08
SMILESNS(=O)(=O)c1ccc(Cl)c(Cl)c1