Reaction Details
TargetBeta-3 adrenergic receptor
LigandBDBM50423818
Substrate/Competitorn/a
Meas. Tech.ChEMBL_770403 (CHEMBL1833712)
Kd 58±n/a nM
Citation Baker, JGAdams, LASalchow, KMistry, SNMiddleton, RJHill, SJKellam, B Synthesis and characterization of high-affinity 4,4-difluoro-4-bora-3a,4a-diaza-s-indacene-labeled fluorescent ligands for humanß-adrenoceptors. J Med Chem54:6874-87 (2011) 
 
Beta-3 adrenergic receptor
Name:Beta-3 adrenergic receptor
Type:G Protein-Coupled Receptor (GPCR)
Mol. Mass.:43534.88
Organism:Homo sapiens (Human)
Description:n/a
Residue:408
BDBM50423818
NameBDBM50423818
Synonyms:CHEMBL1830619
TypeSmall organic molecule
Emp. Form.C47H56BF2N5O7S
Mol. Mass.883.85
SMILESOC(CNCCOCCOCCNC(=O)CCCCCNC(=O)COc1ccc(\C=C\c2ccc3C=C4C=CC(c5cccs5)=[N+]4[B-](F)(F)n23)cc1)COc1ccccc1CC=C