Reaction Details
TargetBeta-1 adrenergic receptor
LigandBDBM50423827
Substrate/Competitorn/a
Meas. Tech.ChEMBL_770400 (CHEMBL1833709)
Kd 3.5±n/a nM
Citation Baker, JGAdams, LASalchow, KMistry, SNMiddleton, RJHill, SJKellam, B Synthesis and characterization of high-affinity 4,4-difluoro-4-bora-3a,4a-diaza-s-indacene-labeled fluorescent ligands for humanß-adrenoceptors. J Med Chem54:6874-87 (2011) 
 
Beta-1 adrenergic receptor
Name:Beta-1 adrenergic receptor
Type:G Protein-Coupled Receptor (GPCR)
Mol. Mass.:51338.40
Organism:Homo sapiens (Human)
Description:P08588
Residue:477
BDBM50423827
NameBDBM50423827
Synonyms:CHEMBL1830491
TypeSmall organic molecule
Emp. Form.C48H54BF2N5O7S
Mol. Mass.893.844
SMILESO[C@@H](CNCCOCCOCCNC(=O)CCCCCNC(=O)COc1ccc(\C=C\c2ccc3C=C4C=CC(c5cccs5)=[N+]4[B-](F)(F)n23)cc1)COc1cccc2ccccc12