Reaction Details
TargetThymidylate kinase
LigandBDBM50132286
Substrate/Competitorn/a
Meas. Tech.ChEMBL_936738 (CHEMBL2319890)
Ki 110000±n/a nM
Citation Toti, KSVerbeke, FRisseeuw, MDFrecer, VMunier-Lehmann, HVan Calenbergh, S Synthesis and evaluation of 5'-modified thymidines and 5-hydroxymethyl-2'-deoxyuridines as Mycobacterium tuberculosis thymidylate kinase inhibitors. Bioorg Med Chem21:257-68 (2012) 
 
Thymidylate kinase
Name:Thymidylate kinase
Type:PROTEIN
Mol. Mass.:22636.29
Organism:Mycobacterium tuberculosis
Description:ChEMBL_208218
Residue:214
BDBM50132286
NameBDBM50132286
Synonyms:(R)-5-Hydroxymethyl-1-((4S,5R)-4-hydroxy-5-methylphosphate-tetrahydro-furan-2-yl)-1H-pyrimidine-2,4-dione
TypeSmall organic molecule
Emp. Form.C10H13N2O9P
Mol. Mass.336.1931
SMILESOCc1cn([C@H]2C[C@H](O)[C@@H](COP([O-])([O-])=O)O2)c(=O)[nH]c1=O