Reaction Details
TargetKappa-type opioid receptor
LigandBDBM50424110
Substrate/Competitorn/a
Meas. Tech.ChEMBL_937278 (CHEMBL2318807)
EC50 8.1±n/a nM
Citation Nemoto, TYamamoto, NWada, NHarada, YTomatsu, MIshihara, MHirayama, SIwai, TFujii, HNagase, H The effect of 17-N substituents on the activity of the opioid¿ receptor in nalfurafine derivatives. Bioorg Med Chem Lett23:268-72 (2012) 
 
Kappa-type opioid receptor
Name:Kappa-type opioid receptor
Type:G Protein-Coupled Receptor (GPCR)
Mol. Mass.:42648.76
Organism:Homo sapiens (Human)
Description:P41145
Residue:380
BDBM50424110
NameBDBM50424110
Synonyms:CHEMBL2315359
TypeSmall organic molecule
Emp. Form.C27H36N2O5
Mol. Mass.468.5851
SMILESCC(C)CN1CC[C@H]2c3c(C[C@@H]1[C@]2(O)CCCN(C)C(=O)\C=C\c1ccoc1)ccc(O)c3O