Reaction Details
TargetKappa-type opioid receptor
LigandBDBM50424108
Substrate/Competitorn/a
Meas. Tech.ChEMBL_937281 (CHEMBL2318810)
Ki 2.2±n/a nM
Citation Nemoto, TYamamoto, NWada, NHarada, YTomatsu, MIshihara, MHirayama, SIwai, TFujii, HNagase, H The effect of 17-N substituents on the activity of the opioid¿ receptor in nalfurafine derivatives. Bioorg Med Chem Lett23:268-72 (2012) 
 
Kappa-type opioid receptor
Name:Kappa-type opioid receptor
Type:G Protein-Coupled Receptor (GPCR)
Mol. Mass.:42744.99
Organism:Cavia porcellus (domestic guinea pig)
Description:P41144
Residue:380
BDBM50424108
NameBDBM50424108
Synonyms:CHEMBL2315357
TypeSmall organic molecule
Emp. Form.C25H30F2N2O5
Mol. Mass.476.5129
SMILESCN(CCC[C@@]1(O)[C@H]2Cc3ccc(O)c(O)c3[C@@H]1CCN2CC(F)F)C(=O)\C=C\c1ccoc1