Reaction Details
TargetMu-type opioid receptor
LigandBDBM50424109
Substrate/Competitorn/a
Meas. Tech.ChEMBL_937283 (CHEMBL2318812)
Ki 8.4±n/a nM
Citation Nemoto, TYamamoto, NWada, NHarada, YTomatsu, MIshihara, MHirayama, SIwai, TFujii, HNagase, H The effect of 17-N substituents on the activity of the opioid¿ receptor in nalfurafine derivatives. Bioorg Med Chem Lett23:268-72 (2012) 
 
Mu-type opioid receptor
Name:Mu-type opioid receptor
Type:Enzyme Catalytic Domain
Mol. Mass.:44431.62
Organism:MOUSE
Description:OPIATE Mu OPRM1 MOUSE::P42866
Residue:398
BDBM50424109
NameBDBM50424109
Synonyms:CHEMBL2315358
TypeSmall organic molecule
Emp. Form.C25H31FN2O5
Mol. Mass.458.5224
SMILESCN(CCC[C@@]1(O)[C@H]2Cc3ccc(O)c(O)c3[C@@H]1CCN2CCF)C(=O)\C=C\c1ccoc1