Reaction Details
TargetMu-type opioid receptor
LigandBDBM50424112
Substrate/Competitorn/a
Meas. Tech.ChEMBL_937283 (CHEMBL2318812)
Ki 11±n/a nM
Citation Nemoto, TYamamoto, NWada, NHarada, YTomatsu, MIshihara, MHirayama, SIwai, TFujii, HNagase, H The effect of 17-N substituents on the activity of the opioid¿ receptor in nalfurafine derivatives. Bioorg Med Chem Lett23:268-72 (2012) 
 
Mu-type opioid receptor
Name:Mu-type opioid receptor
Type:Enzyme Catalytic Domain
Mol. Mass.:44431.62
Organism:MOUSE
Description:OPIATE Mu OPRM1 MOUSE::P42866
Residue:398
BDBM50424112
NameBDBM50424112
Synonyms:CHEMBL2315361
TypeSmall organic molecule
Emp. Form.C25H32N2O5
Mol. Mass.440.532
SMILESCCN1CC[C@H]2c3c(C[C@@H]1[C@]2(O)CCCN(C)C(=O)\C=C\c1ccoc1)ccc(O)c3O