Reaction Details
TargetBcl-2-like protein 1
LigandBDBM50424203
Substrate/Competitorn/a
Meas. Tech.ChEMBL_934032 (CHEMBL2318339)
IC50 37±n/a nM
Citation Song, TLi, XChang, XLiang, XZhao, YWu, GXie, SSu, PWu, ZFeng, YZhang, Z 3-Thiomorpholin-8-oxo-8H-acenaphtho [1,2-b] pyrrole-9-carbonitrile (S1) derivatives as pan-Bcl-2-inhibitors of Bcl-2, Bcl-xL and Mcl-1. Bioorg Med Chem21:11-20 (2012) 
 
Bcl-2-like protein 1
Name:Bcl-2-like protein 1
Type:Mitochondrion membrane; Single-pass membrane protein
Mol. Mass.:26039.60
Organism:Homo sapiens (Human)
Description:n/a
Residue:233
BDBM50424203
NameBDBM50424203
Synonyms:CHEMBL2312476
TypeSmall organic molecule
Emp. Form.C32H28N2O2
Mol. Mass.472.5769
SMILESCC(C)c1ccc(Oc2ccc3c4c(NCCCc5ccccc5)c(=O)nc4c4cccc2c34)cc1