Reaction Details
TargetBcl-2-like protein 1
LigandBDBM50336576
Substrate/Competitorn/a
Meas. Tech.ChEMBL_934032 (CHEMBL2318339)
IC50 625±n/a nM
Citation Song, TLi, XChang, XLiang, XZhao, YWu, GXie, SSu, PWu, ZFeng, YZhang, Z 3-Thiomorpholin-8-oxo-8H-acenaphtho [1,2-b] pyrrole-9-carbonitrile (S1) derivatives as pan-Bcl-2-inhibitors of Bcl-2, Bcl-xL and Mcl-1. Bioorg Med Chem21:11-20 (2012) 
 
Bcl-2-like protein 1
Name:Bcl-2-like protein 1
Type:Mitochondrion membrane; Single-pass membrane protein
Mol. Mass.:26039.60
Organism:Homo sapiens (Human)
Description:n/a
Residue:233
BDBM50336576
NameBDBM50336576
Synonyms:3-Thiomorpholin-8-oxo-8H-acenaphtho[1,2-b]pyrrole-9-carbonitrile CHEMBL595134
TypeSmall organic molecule
Emp. Form.C19H13N3OS
Mol. Mass.331.391
SMILESO=c1nc2c3cccc4c(ccc(c2c1C#N)c34)N1CCSCC1