Reaction Details
TargetApoptosis regulator Bcl-2
LigandBDBM50424208
Substrate/Competitorn/a
Meas. Tech.ChEMBL_934034 (CHEMBL2318341)
IC50 356±n/a nM
Citation Song, TLi, XChang, XLiang, XZhao, YWu, GXie, SSu, PWu, ZFeng, YZhang, Z 3-Thiomorpholin-8-oxo-8H-acenaphtho [1,2-b] pyrrole-9-carbonitrile (S1) derivatives as pan-Bcl-2-inhibitors of Bcl-2, Bcl-xL and Mcl-1. Bioorg Med Chem21:11-20 (2012) 
 
Apoptosis regulator Bcl-2
Name:Apoptosis regulator Bcl-2
Type:Homodimer or heterodimer
Mol. Mass.:26269.11
Organism:Homo sapiens (Human)
Description:P10415
Residue:239
BDBM50424208
NameBDBM50424208
Synonyms:CHEMBL2312471
TypeSmall organic molecule
Emp. Form.C25H22N2O2S
Mol. Mass.414.519
SMILESCCCCNc1c2c3ccc(Sc4ccc(OC)cc4)c4cccc(c2nc1=O)c34