Reaction Details
TargetInduced myeloid leukemia cell differentiation protein Mcl-1
LigandBDBM50424204
Substrate/Competitorn/a
Meas. Tech.ChEMBL_934035 (CHEMBL2318342)
IC50 75±n/a nM
Citation Song, TLi, XChang, XLiang, XZhao, YWu, GXie, SSu, PWu, ZFeng, YZhang, Z 3-Thiomorpholin-8-oxo-8H-acenaphtho [1,2-b] pyrrole-9-carbonitrile (S1) derivatives as pan-Bcl-2-inhibitors of Bcl-2, Bcl-xL and Mcl-1. Bioorg Med Chem21:11-20 (2012) 
 
Induced myeloid leukemia cell differentiation protein Mcl-1
Name:Induced myeloid leukemia cell differentiation protein Mcl-1
Type:Membrane; Single-pass membrane protein
Mol. Mass.:37332.87
Organism:Homo sapiens (Human)
Description:Q07820
Residue:350
BDBM50424204
NameBDBM50424204
Synonyms:CHEMBL2312475
TypeSmall organic molecule
Emp. Form.C29H30N2O2
Mol. Mass.438.5607
SMILESCCCCCCNc1c2c3ccc(Oc4ccc(cc4)C(C)C)c4cccc(c2nc1=O)c34