Reaction Details
TargetInduced myeloid leukemia cell differentiation protein Mcl-1
LigandBDBM50336590
Substrate/Competitorn/a
Meas. Tech.ChEMBL_934035 (CHEMBL2318342)
IC50 90±n/a nM
Citation Song, TLi, XChang, XLiang, XZhao, YWu, GXie, SSu, PWu, ZFeng, YZhang, Z 3-Thiomorpholin-8-oxo-8H-acenaphtho [1,2-b] pyrrole-9-carbonitrile (S1) derivatives as pan-Bcl-2-inhibitors of Bcl-2, Bcl-xL and Mcl-1. Bioorg Med Chem21:11-20 (2012) 
 
Induced myeloid leukemia cell differentiation protein Mcl-1
Name:Induced myeloid leukemia cell differentiation protein Mcl-1
Type:Membrane; Single-pass membrane protein
Mol. Mass.:37332.87
Organism:Homo sapiens (Human)
Description:Q07820
Residue:350
BDBM50336590
NameBDBM50336590
Synonyms:3-(4-aminophenylthio)-8-oxo-8H-acenaphtho[1,2-b]pyrrole-9-carbonitrile | CHEMBL1672082
TypeSmall organic molecule
Emp. Form.C21H11N3OS
Mol. Mass.353.397
SMILESNc1ccc(Sc2ccc3c4c(C#N)c(=O)nc4c4cccc2c34)cc1