Reaction Details
TargetRicin
LigandBDBM50424230
Substrate/Competitorn/a
Meas. Tech.ChEMBL_934991 (CHEMBL2320360)
IC50 60000±n/a nM
Citation Saito, RPruet, JMManzano, LAJasheway, KMonzingo, AFWiget, PAKamat, IAnslyn, EVRobertus, JD Peptide-conjugated pterins as inhibitors of ricin toxin A. J Med Chem56:320-9 (2013) 
 
Ricin
Name:Ricin
Synonyms:RICI_RICCO
Type:PROTEIN
Mol. Mass.:64090.82
Organism:Ricinus communis
Description:ChEMBL_1286970
Residue:576
BDBM50424230
NameBDBM50424230
Synonyms:CHEMBL2314135
TypeSmall organic molecule
Emp. Form.C23H23N9O7
Mol. Mass.537.4848
SMILESNc1nc2nc(cnc2c(=O)[nH]1)C(=O)NCC(=O)N[C@@H](CO)C(=O)N[C@@H](Cc1c[nH]c2ccccc12)C(O)=O