Reaction Details
TargetRicin
LigandBDBM50424235
Substrate/Competitorn/a
Meas. Tech.ChEMBL_934991 (CHEMBL2320360)
IC50 15000±n/a nM
Citation Saito, RPruet, JMManzano, LAJasheway, KMonzingo, AFWiget, PAKamat, IAnslyn, EVRobertus, JD Peptide-conjugated pterins as inhibitors of ricin toxin A. J Med Chem56:320-9 (2013) 
 
Ricin
Name:Ricin
Synonyms:RICI_RICCO
Type:PROTEIN
Mol. Mass.:64090.82
Organism:Ricinus communis
Description:ChEMBL_1286970
Residue:576
BDBM50424235
NameBDBM50424235
Synonyms:CHEMBL2314130
TypeSmall organic molecule
Emp. Form.C27H26N8O6
Mol. Mass.558.5453
SMILESNc1nc2nc(cnc2c(=O)[nH]1)C(=O)NCC(=O)N[C@@H](Cc1ccccc1)C(=O)N[C@@H](Cc1ccccc1)C(O)=O