Reaction Details
TargetRicin
LigandBDBM50424238
Substrate/Competitorn/a
Meas. Tech.ChEMBL_934991 (CHEMBL2320360)
IC50 19000±n/a nM
Citation Saito, RPruet, JMManzano, LAJasheway, KMonzingo, AFWiget, PAKamat, IAnslyn, EVRobertus, JD Peptide-conjugated pterins as inhibitors of ricin toxin A. J Med Chem56:320-9 (2013) 
 
Ricin
Name:Ricin
Synonyms:RICI_RICCO
Type:PROTEIN
Mol. Mass.:64090.82
Organism:Ricinus communis
Description:ChEMBL_1286970
Residue:576
BDBM50424238
NameBDBM50424238
Synonyms:CHEMBL2314127
TypeSmall organic molecule
Emp. Form.C21H20N8O5
Mol. Mass.464.4341
SMILESC[C@H](NC(=O)c1cnc2c(nc(N)[nH]c2=O)n1)C(=O)N[C@@H](Cc1c[nH]c2ccccc12)C(O)=O