Reaction Details
TargetRicin
LigandBDBM6645
Substrate/Competitorn/a
Meas. Tech.ChEMBL_934992 (CHEMBL2320361)
IC50 600000±n/a nM
Citation Saito, RPruet, JMManzano, LAJasheway, KMonzingo, AFWiget, PAKamat, IAnslyn, EVRobertus, JD Peptide-conjugated pterins as inhibitors of ricin toxin A. J Med Chem56:320-9 (2013) 
 
Ricin
Name:Ricin
Synonyms:RICI_RICCO
Type:PROTEIN
Mol. Mass.:64090.82
Organism:Ricinus communis
Description:ChEMBL_1286970
Residue:576
BDBM6645
NameBDBM6645
TypeSmall organic molecule
Emp. Form.C14H12N6O3
Mol. Mass.312.2835
SMILESNc1nc2ncc(CNc3ccc(cc3)C(O)=O)nc2c(=O)[nH]1