Reaction Details
TargetCarbonic anhydrase 2
LigandBDBM50424246
Substrate/Competitorn/a
Meas. Tech.ChEMBL_935017 (CHEMBL2320623)
Ki 136±n/a nM
Citation Balseven, HMustafaIsgör, MMert, SAlim, ZBeydemir, SOk, SKasimogullari, R Facile synthesis and characterization of novel pyrazole-sulfonamides and their inhibition effects on human carbonic anhydrase isoenzymes. Bioorg Med Chem21:21-7 (2012) 
 
Carbonic anhydrase 2
Name:Carbonic anhydrase 2
Type:Enzyme
Mol. Mass.:29250.71
Organism:Homo sapiens (Human)
Description:P00918
Residue:260
BDBM50424246
NameBDBM50424246
Synonyms:CHEMBL2314157
TypeSmall organic molecule
Emp. Form.C30H28N6O8S
Mol. Mass.632.644
SMILESCOC(=O)C(=NNc1cccc(c1)-n1nc(C(=O)Nc2ccc(cc2)S(N)(=O)=O)c(C(O)=O)c1-c1ccccc1)C(=O)C(C)C