Reaction Details
TargetCarbonic anhydrase 2
LigandBDBM50424252
Substrate/Competitorn/a
Meas. Tech.ChEMBL_935017 (CHEMBL2320623)
Ki 259±n/a nM
Citation Balseven, HMustafaIsgör, MMert, SAlim, ZBeydemir, SOk, SKasimogullari, R Facile synthesis and characterization of novel pyrazole-sulfonamides and their inhibition effects on human carbonic anhydrase isoenzymes. Bioorg Med Chem21:21-7 (2012) 
 
Carbonic anhydrase 2
Name:Carbonic anhydrase 2
Type:Enzyme
Mol. Mass.:29250.71
Organism:Homo sapiens (Human)
Description:P00918
Residue:260
BDBM50424252
NameBDBM50424252
Synonyms:CHEMBL2314151
TypeSmall organic molecule
Emp. Form.C28H24N6O7S
Mol. Mass.588.591
SMILES[#6]-[#6](=O)-[#6](=[#7]\[#7]-c1cccc(c1)-n1nc(-[#6](=O)-[#7]-c2ccc(cc2)S([#7])(=O)=O)c(-[#6](-[#8])=O)c1-c1ccccc1)\[#6](-[#6])=O