Reaction Details
TargetCarbonic anhydrase 1
LigandBDBM50424244
Substrate/Competitorn/a
Meas. Tech.ChEMBL_935018 (CHEMBL2320624)
Ki 1079±n/a nM
Citation Balseven, HMustafaIsgör, MMert, SAlim, ZBeydemir, SOk, SKasimogullari, R Facile synthesis and characterization of novel pyrazole-sulfonamides and their inhibition effects on human carbonic anhydrase isoenzymes. Bioorg Med Chem21:21-7 (2012) 
 
Carbonic anhydrase 1
Name:Carbonic anhydrase 1
Type:Enzyme
Mol. Mass.:28873.37
Organism:Homo sapiens (Human)
Description:P00915
Residue:261
BDBM50424244
NameBDBM50424244
Synonyms:CHEMBL2314159
TypeSmall organic molecule
Emp. Form.C29H22N6O6S
Mol. Mass.582.587
SMILESNS(=O)(=O)c1ccc(NC(=O)c2nn(c(c2C(O)=O)-c2ccccc2)-c2cccc(c2)N=Nc2ccc(O)cc2)cc1