Reaction Details
TargetAdenosine receptor A2a
LigandBDBM50335734
Substrate/Competitorn/a
Meas. Tech.ChEMBL_937681 (CHEMBL2317195)
Ki 3345±n/a nM
Citation Yaziji, VRodríguez, DCoelho, AGarcía-Mera, XEl Maatougui, ABrea, JLoza, MICadavid, MIGutiérrez-de-Terán, HSotelo, E Selective and potent adenosine A3 receptor antagonists by methoxyaryl substitution on the N-(2,6-diarylpyrimidin-4-yl)acetamide scaffold. Eur J Med Chem59:235-42 (2013) 
 
Adenosine receptor A2a
Name:Adenosine receptor A2a
Type:G Protein-Coupled Receptor (GPCR)
Mol. Mass.:44716.46
Organism:Homo sapiens (Human)
Description:P29274
Residue:412
BDBM50335734
NameBDBM50335734
Synonyms:CHEMBL1650379 | N-2,6-dibenzo[d][1,3]dioxol-6-yl)pyrimidin-4-yl)acetamide
TypeSmall organic molecule
Emp. Form.C20H15N3O5
Mol. Mass.377.3502
SMILESCC(=O)Nc1cc(nc(n1)-c1ccc2OCOc2c1)-c1ccc2OCOc2c1