Reaction Details
TargetAdenosine receptor A2a
LigandBDBM50424510
Substrate/Competitorn/a
Meas. Tech.ChEMBL_937681 (CHEMBL2317195)
Ki 375±n/a nM
Citation Yaziji, VRodríguez, DCoelho, AGarcía-Mera, XEl Maatougui, ABrea, JLoza, MICadavid, MIGutiérrez-de-Terán, HSotelo, E Selective and potent adenosine A3 receptor antagonists by methoxyaryl substitution on the N-(2,6-diarylpyrimidin-4-yl)acetamide scaffold. Eur J Med Chem59:235-42 (2013) 
 
Adenosine receptor A2a
Name:Adenosine receptor A2a
Type:G Protein-Coupled Receptor (GPCR)
Mol. Mass.:44716.46
Organism:Homo sapiens (Human)
Description:P29274
Residue:412
BDBM50424510
NameBDBM50424510
Synonyms:CHEMBL2311745
TypeSmall organic molecule
Emp. Form.C22H23N3O5
Mol. Mass.409.4351
SMILESCOc1cccc(-c2cc(NC(C)=O)nc(n2)-c2cccc(OC)c2OC)c1OC