Reaction Details
TargetAdenosine receptor A2a
LigandBDBM50424511
Substrate/Competitorn/a
Meas. Tech.ChEMBL_937681 (CHEMBL2317195)
Ki 49±n/a nM
Citation Yaziji, VRodríguez, DCoelho, AGarcía-Mera, XEl Maatougui, ABrea, JLoza, MICadavid, MIGutiérrez-de-Terán, HSotelo, E Selective and potent adenosine A3 receptor antagonists by methoxyaryl substitution on the N-(2,6-diarylpyrimidin-4-yl)acetamide scaffold. Eur J Med Chem59:235-42 (2013) 
 
Adenosine receptor A2a
Name:Adenosine receptor A2a
Type:G Protein-Coupled Receptor (GPCR)
Mol. Mass.:44716.46
Organism:Homo sapiens (Human)
Description:P29274
Residue:412
BDBM50424511
NameBDBM50424511
Synonyms:CHEMBL2311741
TypeSmall organic molecule
Emp. Form.C20H19N3O3
Mol. Mass.349.3832
SMILESCOc1cccc(c1)-c1cc(NC(C)=O)nc(n1)-c1cccc(OC)c1