Reaction Details
TargetAdenosine receptor A2a
LigandBDBM50157676
Substrate/Competitorn/a
Meas. Tech.ChEMBL_937681 (CHEMBL2317195)
Ki 255±n/a nM
Citation Yaziji, VRodríguez, DCoelho, AGarcía-Mera, XEl Maatougui, ABrea, JLoza, MICadavid, MIGutiérrez-de-Terán, HSotelo, E Selective and potent adenosine A3 receptor antagonists by methoxyaryl substitution on the N-(2,6-diarylpyrimidin-4-yl)acetamide scaffold. Eur J Med Chem59:235-42 (2013) 
 
Adenosine receptor A2a
Name:Adenosine receptor A2a
Type:G Protein-Coupled Receptor (GPCR)
Mol. Mass.:44716.46
Organism:Homo sapiens (Human)
Description:P29274
Residue:412
BDBM50157676
NameBDBM50157676
Synonyms:CHEMBL426565 | N-(2,6-diphenylpyrimidin-4-yl)acetamide
TypeSmall organic molecule
Emp. Form.C18H15N3O
Mol. Mass.289.3312
SMILESCC(=O)Nc1cc(nc(n1)-c1ccccc1)-c1ccccc1