Reaction Details
TargetAdenosine receptor A1
LigandBDBM50424511
Substrate/Competitorn/a
Meas. Tech.ChEMBL_937682 (CHEMBL2317196)
Ki 23±n/a nM
Citation Yaziji, VRodríguez, DCoelho, AGarcía-Mera, XEl Maatougui, ABrea, JLoza, MICadavid, MIGutiérrez-de-Terán, HSotelo, E Selective and potent adenosine A3 receptor antagonists by methoxyaryl substitution on the N-(2,6-diarylpyrimidin-4-yl)acetamide scaffold. Eur J Med Chem59:235-42 (2013) 
 
Adenosine receptor A1
Name:Adenosine receptor A1
Type:G Protein-Coupled Receptor (GPCR)
Mol. Mass.:36520.92
Organism:Homo sapiens (Human)
Description:P30542
Residue:326
BDBM50424511
NameBDBM50424511
Synonyms:CHEMBL2311741
TypeSmall organic molecule
Emp. Form.C20H19N3O3
Mol. Mass.349.3832
SMILESCOc1cccc(c1)-c1cc(NC(C)=O)nc(n1)-c1cccc(OC)c1