Reaction Details
TargetAdenosine receptor A3
LigandBDBM50424512
Substrate/Competitorn/a
Meas. Tech.ChEMBL_937677 (CHEMBL2317191)
Ki 26±n/a nM
Citation Yaziji, VRodríguez, DCoelho, AGarcía-Mera, XEl Maatougui, ABrea, JLoza, MICadavid, MIGutiérrez-de-Terán, HSotelo, E Selective and potent adenosine A3 receptor antagonists by methoxyaryl substitution on the N-(2,6-diarylpyrimidin-4-yl)acetamide scaffold. Eur J Med Chem59:235-42 (2013) 
 
Adenosine receptor A3
Name:Adenosine receptor A3
Type:G Protein-Coupled Receptor (GPCR)
Mol. Mass.:36197.32
Organism:Homo sapiens (Human)
Description:P0DMS8
Residue:318
BDBM50424512
NameBDBM50424512
Synonyms:CHEMBL2312112
TypeSmall organic molecule
Emp. Form.C24H27N3O7
Mol. Mass.469.4871
SMILESCOc1cc(cc(OC)c1OC)-c1cc(NC(C)=O)nc(n1)-c1cc(OC)c(OC)c(OC)c1