Reaction Details
TargetAdenosine receptor A3
LigandBDBM50424516
Substrate/Competitorn/a
Meas. Tech.ChEMBL_937677 (CHEMBL2317191)
Ki 513±n/a nM
Citation Yaziji, VRodríguez, DCoelho, AGarcía-Mera, XEl Maatougui, ABrea, JLoza, MICadavid, MIGutiérrez-de-Terán, HSotelo, E Selective and potent adenosine A3 receptor antagonists by methoxyaryl substitution on the N-(2,6-diarylpyrimidin-4-yl)acetamide scaffold. Eur J Med Chem59:235-42 (2013) 
 
Adenosine receptor A3
Name:Adenosine receptor A3
Type:G Protein-Coupled Receptor (GPCR)
Mol. Mass.:36197.32
Organism:Homo sapiens (Human)
Description:P0DMS8
Residue:318
BDBM50424516
NameBDBM50424516
Synonyms:CHEMBL2311744
TypeSmall organic molecule
Emp. Form.C24H23N3O3
Mol. Mass.401.4577
SMILESCOc1ccc(\C=C\c2cc(NC(C)=O)nc(\C=C\c3ccc(OC)cc3)n2)cc1