Reaction Details
TargetAdenosine receptor A3
LigandBDBM50424517
Substrate/Competitorn/a
Meas. Tech.ChEMBL_937677 (CHEMBL2317191)
Ki 40±n/a nM
Citation Yaziji, VRodríguez, DCoelho, AGarcía-Mera, XEl Maatougui, ABrea, JLoza, MICadavid, MIGutiérrez-de-Terán, HSotelo, E Selective and potent adenosine A3 receptor antagonists by methoxyaryl substitution on the N-(2,6-diarylpyrimidin-4-yl)acetamide scaffold. Eur J Med Chem59:235-42 (2013) 
 
Adenosine receptor A3
Name:Adenosine receptor A3
Type:G Protein-Coupled Receptor (GPCR)
Mol. Mass.:36197.32
Organism:Homo sapiens (Human)
Description:P0DMS8
Residue:318
BDBM50424517
NameBDBM50424517
Synonyms:CHEMBL2311743
TypeSmall organic molecule
Emp. Form.C22H23N3O3
Mol. Mass.377.4363
SMILESCCOc1ccc(cc1)-c1cc(NC(C)=O)nc(n1)-c1ccc(OCC)cc1