Reaction Details
TargetAdenosine receptor A3
LigandBDBM50335728
Substrate/Competitorn/a
Meas. Tech.ChEMBL_937677 (CHEMBL2317191)
Ki 24±n/a nM
Citation Yaziji, VRodríguez, DCoelho, AGarcía-Mera, XEl Maatougui, ABrea, JLoza, MICadavid, MIGutiérrez-de-Terán, HSotelo, E Selective and potent adenosine A3 receptor antagonists by methoxyaryl substitution on the N-(2,6-diarylpyrimidin-4-yl)acetamide scaffold. Eur J Med Chem59:235-42 (2013) 
 
Adenosine receptor A3
Name:Adenosine receptor A3
Type:G Protein-Coupled Receptor (GPCR)
Mol. Mass.:36197.32
Organism:Homo sapiens (Human)
Description:P0DMS8
Residue:318
BDBM50335728
NameBDBM50335728
Synonyms:CHEMBL1650373 | N-2,6-bis2-fluorophenyl)pyrimidin-4-yl)acetamide
TypeSmall organic molecule
Emp. Form.C20H19N3O3
Mol. Mass.349.3832
SMILESCOc1ccccc1-c1cc(NC(C)=O)nc(n1)-c1ccccc1OC