Reaction Details
TargetEgl nine homolog 1
LigandBDBM50193145
Substrate/Competitorn/a
Meas. Tech.ChEMBL_934089 (CHEMBL2318591)
IC50 70±n/a nM
Citation Leung, IKDemetriades, MHardy, APLejeune, CSmart, TJSzöllössi, AKawamura, ASchofield, CJClaridge, TD Reporter ligand NMR screening method for 2-oxoglutarate oxygenase inhibitors. J Med Chem56:547-55 (2013) 
 
Egl nine homolog 1
Name:Egl nine homolog 1
Type:Protein
Mol. Mass.:46035.59
Organism:Homo sapiens (Human)
Description:Q9GZT9
Residue:426
BDBM50193145
NameBDBM50193145
Synonyms:2-(1-chloro-4-hydroxyisoquinoline-3-carboxamido)acetic acid Isoquinoline 3 | N-[(1-CHLORO-4-HYDROXYISOQUINOLIN-3-YL)CARBONYL]GLYCINE
TypeSmall organic molecule
Emp. Form.C12H9ClN2O4
Mol. Mass.280.664
SMILESOC(=O)CNC(=O)c1nc(Cl)c2ccccc2c1O