Reaction Details
TargetAcetolactate synthase catalytic subunit, mitochondrial
LigandBDBM50424587
Substrate/Competitorn/a
Meas. Tech.ChEMBL_934102 (CHEMBL2318855)
Ki 346±n/a nM
Citation Lee, YTCui, CJChow, EWPue, NLonhienne, TWang, JGFraser, JAGuddat, LW Sulfonylureas have antifungal activity and are potent inhibitors of Candida albicans acetohydroxyacid synthase. J Med Chem56:210-9 (2013) 
 
Acetolactate synthase catalytic subunit, mitochondrial
Name:Acetolactate synthase catalytic subunit, mitochondrial
Type:PROTEIN
Mol. Mass.:74947.98
Organism:Saccharomyces cerevisiae
Description:ChEMBL_934102
Residue:687
BDBM50424587
NameBDBM50424587
Synonyms:CHEMBL1885280 | Ethametsulfuron Methyl
TypeSmall organic molecule
Emp. Form.C15H18N6O6S
Mol. Mass.410.405
SMILESCCOc1nc(NC)nc(NC(=O)NS(=O)(=O)c2ccccc2C(=O)OC)n1