Reaction Details
TargetAcetolactate synthase catalytic subunit, mitochondrial
LigandBDBM50424588
Substrate/Competitorn/a
Meas. Tech.ChEMBL_934102 (CHEMBL2318855)
Ki 51±n/a nM
Citation Lee, YTCui, CJChow, EWPue, NLonhienne, TWang, JGFraser, JAGuddat, LW Sulfonylureas have antifungal activity and are potent inhibitors of Candida albicans acetohydroxyacid synthase. J Med Chem56:210-9 (2013) 
 
Acetolactate synthase catalytic subunit, mitochondrial
Name:Acetolactate synthase catalytic subunit, mitochondrial
Type:PROTEIN
Mol. Mass.:74947.98
Organism:Saccharomyces cerevisiae
Description:ChEMBL_934102
Residue:687
BDBM50424588
NameBDBM50424588
Synonyms:SULFOMETURON METHYL
TypeSmall organic molecule
Emp. Form.C15H16N4O5S
Mol. Mass.364.376
SMILESCOC(=O)c1ccccc1S(=O)(=O)NC(=O)Nc1nc(C)cc(C)n1