Reaction Details
TargetAcetolactate synthase catalytic subunit, mitochondrial
LigandBDBM50424589
Substrate/Competitorn/a
Meas. Tech.ChEMBL_934102 (CHEMBL2318855)
Ki 127±n/a nM
Citation Lee, YTCui, CJChow, EWPue, NLonhienne, TWang, JGFraser, JAGuddat, LW Sulfonylureas have antifungal activity and are potent inhibitors of Candida albicans acetohydroxyacid synthase. J Med Chem56:210-9 (2013) 
 
Acetolactate synthase catalytic subunit, mitochondrial
Name:Acetolactate synthase catalytic subunit, mitochondrial
Type:PROTEIN
Mol. Mass.:74947.98
Organism:Saccharomyces cerevisiae
Description:ChEMBL_934102
Residue:687
BDBM50424589
NameBDBM50424589
Synonyms:CHEMBL1229721 | DNDI1246776
TypeSmall organic molecule
Emp. Form.C12H12ClN5O4S
Mol. Mass.357.773
SMILESCOc1nc(C)nc(NC(=O)NS(=O)(=O)c2ccccc2Cl)n1