Reaction Details
TargetAcetolactate synthase catalytic subunit, mitochondrial
LigandBDBM50424592
Substrate/Competitorn/a
Meas. Tech.ChEMBL_934102 (CHEMBL2318855)
Ki 64±n/a nM
Citation Lee, YTCui, CJChow, EWPue, NLonhienne, TWang, JGFraser, JAGuddat, LW Sulfonylureas have antifungal activity and are potent inhibitors of Candida albicans acetohydroxyacid synthase. J Med Chem56:210-9 (2013) 
 
Acetolactate synthase catalytic subunit, mitochondrial
Name:Acetolactate synthase catalytic subunit, mitochondrial
Type:PROTEIN
Mol. Mass.:74947.98
Organism:Saccharomyces cerevisiae
Description:ChEMBL_934102
Residue:687
BDBM50424592
NameBDBM50424592
Synonyms:CHEMBL2313153 | Ethoxysulfuron
TypeSmall organic molecule
Emp. Form.C15H18N4O7S
Mol. Mass.398.391
SMILESCCOc1ccccc1OS(=O)(=O)NC(=O)Nc1nc(OC)cc(OC)n1