Reaction Details
TargetAcetolactate synthase catalytic subunit, mitochondrial
LigandBDBM50424585
Substrate/Competitorn/a
Meas. Tech.ChEMBL_934102 (CHEMBL2318855)
Ki 3.3±n/a nM
Citation Lee, YTCui, CJChow, EWPue, NLonhienne, TWang, JGFraser, JAGuddat, LW Sulfonylureas have antifungal activity and are potent inhibitors of Candida albicans acetohydroxyacid synthase. J Med Chem56:210-9 (2013) 
 
Acetolactate synthase catalytic subunit, mitochondrial
Name:Acetolactate synthase catalytic subunit, mitochondrial
Type:PROTEIN
Mol. Mass.:74947.98
Organism:Saccharomyces cerevisiae
Description:ChEMBL_934102
Residue:687
BDBM50424585
NameBDBM50424585
Synonyms:CHEMBL1231791 | Chlorimuron Ethyl
TypeSmall organic molecule
Emp. Form.C15H15ClN4O6S
Mol. Mass.414.821
SMILESCCOC(=O)c1ccccc1S(=O)(=O)NC(=O)Nc1nc(Cl)cc(OC)n1