Reaction Details
TargetTransitional endoplasmic reticulum ATPase
LigandBDBM50424917
Substrate/Competitorn/a
Meas. Tech.ChEMBL_934533 (CHEMBL2317274)
IC50 24±n/a nM
Citation Angiolini, MAsa, DAvanzi, NBadari, ABertrand, JCasale, ECirla, ACozzi, LCauteruccio, SDonati, DGalvani, AIsacchi, AJackson, PKLiu, YMagnaghi, PMagnuson, SMalgesini, BNuvoloni, SOrrenius, CPolucci, PRiceputi, LTrucchi, BO Brien, TRizzi, SSirtori, FRD Alessio, R Alkylsulfanyl-1,2,4-triazoles, a new class of allosteric valosine containing protein inhibitors. Synthesis and structure-activity relationships. J Med Chem56:437-50 (2013) 
 
Transitional endoplasmic reticulum ATPase
Name:Transitional endoplasmic reticulum ATPase
Type:Enzyme
Mol. Mass.:89300.63
Organism:Homo sapiens (Human)
Description:P55072
Residue:806
BDBM50424917
NameBDBM50424917
Synonyms:CHEMBL2311578
TypeSmall organic molecule
Emp. Form.C27H28N4O3S2
Mol. Mass.520.666
SMILESCc1cc(OCc2nnc(SC3CCCC3)n2-c2cccnc2)ccc1-c1ccc(cc1)S(C)(=O)=O