Reaction Details
TargetHistone deacetylase 11
LigandBDBM50424996
Substrate/Competitorn/a
Meas. Tech.ChEMBL_936026 (CHEMBL2318992)
IC50 852±n/a nM
Citation Marek, LHamacher, AHansen, FKKuna, KGohlke, HKassack, MUKurz, T Histone deacetylase (HDAC) inhibitors with a novel connecting unit linker region reveal a selectivity profile for HDAC4 and HDAC5 with improved activity against chemoresistant cancer cells. J Med Chem56:427-36 (2013) 
 
Histone deacetylase 11
Name:Histone deacetylase 11
Type:Chromatin regulator; hydrolase; repressor
Mol. Mass.:39187.66
Organism:Homo sapiens (Human)
Description:Q96DB2
Residue:347
BDBM50424996
NameBDBM50424996
Synonyms:CHEMBL2312168
TypeSmall organic molecule
Emp. Form.C15H22N2O4
Mol. Mass.294.3462
SMILESCc1cc(C)cc(c1)C(=O)NOCCCCCC(=O)NO