Reaction Details
TargetHistone deacetylase 1
LigandBDBM50424996
Substrate/Competitorn/a
Meas. Tech.ChEMBL_936032 (CHEMBL2318998)
IC50 320±n/a nM
Citation Marek, LHamacher, AHansen, FKKuna, KGohlke, HKassack, MUKurz, T Histone deacetylase (HDAC) inhibitors with a novel connecting unit linker region reveal a selectivity profile for HDAC4 and HDAC5 with improved activity against chemoresistant cancer cells. J Med Chem56:427-36 (2013) 
 
Histone deacetylase 1
Name:Histone deacetylase 1
Type:Enzyme
Mol. Mass.:55090.27
Organism:Homo sapiens (Human)
Description:Q13547
Residue:482
BDBM50424996
NameBDBM50424996
Synonyms:CHEMBL2312168
TypeSmall organic molecule
Emp. Form.C15H22N2O4
Mol. Mass.294.3462
SMILESCc1cc(C)cc(c1)C(=O)NOCCCCCC(=O)NO