Reaction Details
TargetHistone deacetylase 5
LigandBDBM50424997
Substrate/Competitorn/a
Meas. Tech.ChEMBL_936029 (CHEMBL2318995)
IC50 33±n/a nM
Citation Marek, LHamacher, AHansen, FKKuna, KGohlke, HKassack, MUKurz, T Histone deacetylase (HDAC) inhibitors with a novel connecting unit linker region reveal a selectivity profile for HDAC4 and HDAC5 with improved activity against chemoresistant cancer cells. J Med Chem56:427-36 (2013) 
 
Histone deacetylase 5
Name:Histone deacetylase 5
Type:Enzyme
Mol. Mass.:121968.61
Organism:Homo sapiens (Human)
Description:Q9UQL6
Residue:1122
BDBM50424997
NameBDBM50424997
Synonyms:CHEMBL2312167
TypeSmall organic molecule
Emp. Form.C15H22N2O4
Mol. Mass.294.3462
SMILESCc1ccc(cc1C)C(=O)NOCCCCCC(=O)NO