Reaction Details
TargetPotassium voltage-gated channel subfamily A member 5
LigandBDBM50425100
Substrate/Competitorn/a
Meas. Tech.ChEMBL_936633 (CHEMBL2319032)
IC50 620±n/a nM
Citation Olsson, RIJacobson, IBoström, JFex, TBjöre, AOlsson, CSundell, JGran, UÖhrn, ANordin, AGyll, JThorstensson, MHayen, AAplander, KHidestål, OJiang, FLinhardt, GForsström, ECollins, TSundqvist, MLindhardt, EÅstrand, ALöfberg, B Synthesis and evaluation of diphenylphosphinic amides and diphenylphosphine oxides as inhibitors of Kv1.5. Bioorg Med Chem Lett23:706-10 (2013) 
 
Potassium voltage-gated channel subfamily A member 5
Name:Potassium voltage-gated channel subfamily A member 5
Type:Enzyme
Mol. Mass.:67222.47
Organism:Homo sapiens (Human)
Description:P22460
Residue:613
BDBM50425100
NameBDBM50425100
Synonyms:CHEMBL2313227
TypeSmall organic molecule
Emp. Form.C20H21N2O2P
Mol. Mass.352.3667
SMILESCOCCN(c1cccnc1)P(=O)(c1ccccc1)c1ccccc1